BDBM47193 MLS000529710::N-[2-(2-methyl-1-indolyl)ethyl]-4-(1-piperidinylsulfonyl)benzamide::N-[2-(2-methylindol-1-yl)ethyl]-4-piperidin-1-ylsulfonyl-benzamide::N-[2-(2-methylindol-1-yl)ethyl]-4-piperidin-1-ylsulfonylbenzamide::N-[2-(2-methylindol-1-yl)ethyl]-4-piperidinosulfonyl-benzamide::SMR000127174::cid_4293343
SMILES Cc1cc2ccccc2n1CCNC(=O)c1ccc(cc1)S(=O)(=O)N1CCCCC1
InChI Key InChIKey=LESNIINNAAZFGP-UHFFFAOYSA-N
Data  5 EC50
  Tab Delimited (TSV)   2D SDfile   Computed 3D by Vconf -m prep SDfile
Find this compound or compounds like it in BindingDB:
Activity Spreadsheet -- Enzyme Inhibition Constant Data from BindingDB
Found 5 hits for monomerid = 47193
TargetLethal factor(Bacillus anthracis)
Nmmlsc
Curated by PubChem BioAssay
LigandPNGBDBM47193(MLS000529710 | N-[2-(2-methyl-1-indolyl)ethyl]-4-(...)
Affinity DataEC50: >2.00E+4nM. Assay description: University of New Mexico Assay Overview: Assay Support: 1 R03 MH093184-01A1 Project Title: High-throughput multiplex microsphere screening for tox...
In DepthDetails PCBioAssay
TargetBotulinum neurotoxin type A(Clostridium botulinum (strain Hall / ATCC 3502 / N...)
Nmmlsc
Curated by PubChem BioAssay
LigandPNGBDBM47193(MLS000529710 | N-[2-(2-methyl-1-indolyl)ethyl]-4-(...)
Affinity DataEC50:  1.00E+3nM. Assay description: University of New Mexico Assay Overview: Assay Support: 1 R03 MH093184-01A1 Project Title: High-throughput multiplex microsphere screening for tox...
In DepthDetails PCBioAssay
TargetBotulinum neurotoxin type F(Clostridium botulinum Bf)
Nmmlsc
Curated by PubChem BioAssay
LigandPNGBDBM47193(MLS000529710 | N-[2-(2-methyl-1-indolyl)ethyl]-4-(...)
Affinity DataEC50: >2.00E+4nM. Assay description: University of New Mexico Assay Overview: Assay Support: 1 R03 MH093184-01A1 Project Title: High-throughput multiplex microsphere screening for tox...
In DepthDetails PCBioAssay
TargetLethal factor(Bacillus anthracis)
Nmmlsc
Curated by PubChem BioAssay
LigandPNGBDBM47193(MLS000529710 | N-[2-(2-methyl-1-indolyl)ethyl]-4-(...)
Affinity DataEC50: >2.00E+4nM. Assay description: University of New Mexico Assay Overview: Assay Support: 1 R03 MH093184-01A1 Project Title: High-throughput multiplex microsphere screening for tox...
In DepthDetails PCBioAssay
TargetBotulinum neurotoxin type A(Clostridium botulinum (strain Hall / ATCC 3502 / N...)
Nmmlsc
Curated by PubChem BioAssay
LigandPNGBDBM47193(MLS000529710 | N-[2-(2-methyl-1-indolyl)ethyl]-4-(...)
Affinity DataEC50: >2.00E+4nM. Assay description: University of New Mexico Assay Overview: Assay Support: 1 R03 MH093184-01A1 Project Title: High-throughput multiplex microsphere screening for tox...
In DepthDetails PCBioAssay