BDBM50002466 AZTMPNPP3'-azido-3'-deoxythymidine 5'-[alpha,beta-imido]triphosphate
SMILES Cc1cn([C@H]2C[C@@H](N=[N+]=[N-])[C@@H](OP([O-])(=O)NP([O-])(=O)OP([O-])([O-])=O)O2)c(=O)[nH]c1=O
InChI Key InChIKey=ALOAKUKTJBJNDK-ATRFCDNQSA-J
Data  1 KI
  Tab Delimited (TSV)   2D SDfile   Computed 3D by Vconf -m prep SDfile
Find this compound or compounds like it in BindingDB:
Activity Spreadsheet -- Enzyme Inhibition Constant Data from BindingDB
Found 1 hit for monomerid = 50002466
TargetReverse transcriptase/RNaseH(Human immunodeficiency virus 1)
University Of California
Curated by ChEMBL
LigandPNGBDBM50002466(AZTMPNPP3'-azido-3'-deoxythymidine 5'-[alpha,beta-...)
Affinity DataKi:  2.20E+4nM. Assay description: The compound was tested for the inhibition of human immunodeficiency virus-1 reverse transcriptase(HIV-1 RT).
In DepthDetails ArticlePubMed