BDBM50003424 3-(Benzyl-hydroxy-amino)-1-biphenyl-4-yl-propenone::CHEMBL132854
SMILES ON(Cc1ccccc1)\C=C/C(=O)c1ccc(cc1)-c1ccccc1
InChI Key InChIKey=QXRSVQDPDIABBH-NXVVXOECSA-N
Data  1 IC50
  Tab Delimited (TSV)   2D SDfile   Computed 3D by Vconf -m prep SDfile
Find this compound or compounds like it in BindingDB:
Activity Spreadsheet -- Enzyme Inhibition Constant Data from BindingDB
Found 1 hit for monomerid = 50003424
TargetPolyunsaturated fatty acid 5-lipoxygenase(Rattus norvegicus)
Dupont Pharmaceuticals
Curated by ChEMBL
LigandPNGBDBM50003424(3-(Benzyl-hydroxy-amino)-1-biphenyl-4-yl-propenone...)
Affinity DataIC50:  250nM. Assay description: inhibitory activity against 5-lipoxygenase in rat basophilic leukemia cell line.
In DepthDetails ArticlePubMed