BDBM50003541 CHEMBL553093::N-{2-[4-(Cyano-pyridin-3-yl-methyl)-piperazin-1-yl]-ethyl}-3,3-diphenyl-propionamide; trihydrochloride
SMILES O=C(CC(c1ccccc1)c1ccccc1)NCCN1CCN(CC1)C(C#N)c1cccnc1
InChI Key InChIKey=VLRSTELNBYPPIF-UHFFFAOYSA-N
Data  1 IC50
  Tab Delimited (TSV)   2D SDfile   Computed 3D by Vconf -m prep SDfile
Find this compound or compounds like it in BindingDB:
Activity Spreadsheet -- Enzyme Inhibition Constant Data from BindingDB
Found 1 hit for monomerid = 50003541
TargetPlatelet-activating factor receptor(Cavia porcellus)
J. Uriach & C£A.S.A.
Curated by ChEMBL
LigandPNGBDBM50003541(CHEMBL553093 | N-{2-[4-(Cyano-pyridin-3-yl-methyl)...)
Affinity DataIC50:  5.50E+3nM. Assay description: Concentration tested in vitro to inhibit PAF-induced maximum aggregation (PAF-Antagonistic activity) by 50%.
In DepthDetails ArticlePubMed