BDBM50004072 (S)-2-Benzyloxycarbonylamino-3-[4-(3-tert-butylamino-2-hydroxy-propoxy)-phenyl]-propionic acid::2-Benzyloxycarbonylamino-3-[4-(3-tert-butylamino-2-hydroxy-propoxy)-phenyl]-propionic acid::CHEMBL83247
SMILES CC(C)(C)NCC(O)COc1ccc(C[C@H](NC(=O)OCc2ccccc2)C(O)=O)cc1
InChI Key InChIKey=CDHVLQSLOGCKJZ-QWAKEFERSA-N
Data  4 IC50
  Tab Delimited (TSV)   2D SDfile   Computed 3D by Vconf -m prep SDfile
Find this compound or compounds like it in BindingDB:
Activity Spreadsheet -- Enzyme Inhibition Constant Data from BindingDB
Found 4 hits for monomerid = 50004072
TargetIntegrin alpha-V/beta-3(Homo sapiens (Human))
Merck Research Laboratories
Curated by ChEMBL
LigandPNGBDBM50004072((S)-2-Benzyloxycarbonylamino-3-[4-(3-tert-butylami...)
Affinity DataIC50: >3.00E+5nM. Assay description: Inhibition of human umbilical vein endothelial cell adhesion to fibrinogen
In DepthDetails ArticlePubMed
TargetIntegrin alpha-IIb/beta-3(Homo sapiens (Human))
Merck Research Laboratories
Curated by ChEMBL
LigandPNGBDBM50004072((S)-2-Benzyloxycarbonylamino-3-[4-(3-tert-butylami...)
Affinity DataIC50:  2.70E+4nM. Assay description: In vitro inhibition of ADP-mediated human gel filtered platelet aggregation.
In DepthDetails ArticlePubMed
TargetIntegrin alpha-IIb/beta-3(Homo sapiens (Human))
Merck Research Laboratories
Curated by ChEMBL
LigandPNGBDBM50004072((S)-2-Benzyloxycarbonylamino-3-[4-(3-tert-butylami...)
Affinity DataIC50:  3.50E+4nM. Assay description: Inhibition of platelet aggregation as the concentration necessary to inhibit the change in light .
In DepthDetails ArticlePubMed
TargetIntegrin alpha-V/beta-3(Homo sapiens (Human))
Merck Research Laboratories
Curated by ChEMBL
LigandPNGBDBM50004072((S)-2-Benzyloxycarbonylamino-3-[4-(3-tert-butylami...)
Affinity DataIC50: >3.00E+5nM. Assay description: Inhibition of human umbilical vein endothelial cell adhesion to vitronectin
In DepthDetails ArticlePubMed