BDBM50004548 CHEMBL2216864
SMILES CC(Nc1ncnc2[nH]cnc12)c1c(nc2c(C)cccn12)-c1cc(F)cc(F)c1
InChI Key InChIKey=CPTIBQXPYIQVLM-UHFFFAOYSA-N
Data  2 IC50
  Tab Delimited (TSV)   2D SDfile   Computed 3D by Vconf -m prep SDfile
Find this compound or compounds like it in BindingDB:
Activity Spreadsheet -- Enzyme Inhibition Constant Data from BindingDB
Found 2 hits for monomerid = 50004548
LigandPNGBDBM50004548(CHEMBL2216864)
Affinity DataIC50: <500nM. Assay description: Inhibition of PI3Kdelta-mediated AKT phosphorylation in human Ramos cells by ELISA
In DepthDetails ArticlePubMed
LigandPNGBDBM50004548(CHEMBL2216864)
Affinity DataIC50: <200nM. Assay description: Inhibition of PI3Kdelta
In DepthDetails ArticlePubMed