BDBM50005268 2-(4-Bromo-2-methoxy-phenyl)-ethylamine::CHEMBL163985
SMILES COc1cc(Br)ccc1CCN
InChI Key InChIKey=OTADZJZZPXOZQT-UHFFFAOYSA-N
Data  2 KI
  Tab Delimited (TSV)   2D SDfile   Computed 3D by Vconf -m prep SDfile
Find this compound or compounds like it in BindingDB:
Activity Spreadsheet -- Enzyme Inhibition Constant Data from BindingDB
Found 2 hits for monomerid = 50005268
Target5-hydroxytryptamine receptor 2C(Rattus norvegicus (Rat))
Virginia Commonwealth University
Curated by ChEMBL
LigandPNGBDBM50005268(2-(4-Bromo-2-methoxy-phenyl)-ethylamine | CHEMBL16...)
Affinity DataKi:  220nM. Assay description: Binding affinity towards 5-hydroxytryptamine 1C receptor from frontal cortical regions of male Sprague-Dawley rat homogenates, using [3H]mesulergine ...
In DepthDetails ArticlePubMed
TargetSerotonin 2 (5-HT2) receptor(RAT)
Virginia Commonwealth University
Curated by ChEMBL
LigandPNGBDBM50005268(2-(4-Bromo-2-methoxy-phenyl)-ethylamine | CHEMBL16...)
Affinity DataKi:  1.03E+3nM. Assay description: Binding affinity towards 5-hydroxytryptamine 2 receptor from frontal cortical regions of male Sprague-Dawley rat homogenates, using [3H]ketanserin as...
In DepthDetails ArticlePubMed