BDBM50005913 2-Allyl-1,8-dimethoxy-anthraquinone::CHEMBL41047
SMILES COc1cccc2C(=O)c3ccc(CC=C)c(OC)c3C(=O)c12
InChI Key InChIKey=CUOACMDJIPKRBT-UHFFFAOYSA-N
Data  1 IC50
  Tab Delimited (TSV)   2D SDfile   Computed 3D by Vconf -m prep SDfile
Find this compound or compounds like it in BindingDB:
Activity Spreadsheet -- Enzyme Inhibition Constant Data from BindingDB
Found 1 hit for monomerid = 50005913
TargetCathepsin G(Homo sapiens (Human))
Georgia Institute Of Technology
Curated by ChEMBL
LigandPNGBDBM50005913(2-Allyl-1,8-dimethoxy-anthraquinone | CHEMBL41047)
Affinity DataIC50: >6.00E+4nM. Assay description: Inhibition of Cathepsin G (CatG)
In DepthDetails ArticlePubMed