BDBM50005946 2,2-Dimethyl-dodecanoic acid (4-bromo-2,6-dimethyl-phenyl)-amide::CHEMBL297834
SMILES CCCCCCCCCCC(C)(C)C(=O)Nc1c(C)cc(Br)cc1C
InChI Key InChIKey=YHZJFKDGIPDLFY-UHFFFAOYSA-N
Data  1 IC50
  Tab Delimited (TSV)   2D SDfile   Computed 3D by Vconf -m prep SDfile
Find this compound or compounds like it in BindingDB:
Activity Spreadsheet -- Enzyme Inhibition Constant Data from BindingDB
Found 1 hit for monomerid = 50005946
TargetAcyl-CoA:cholesterol acyltransferase(Oryctolagus cuniculus)
Warner-Lambert
Curated by ChEMBL
LigandPNGBDBM50005946(2,2-Dimethyl-dodecanoic acid (4-bromo-2,6-dimethyl...)
Affinity DataIC50:  410nM. Assay description: In vitro inhibition of acyl coenzyme A:cholesterol acyltransferase, in intestinal microsomes isolated from cholesterol-fed rabbits
In DepthDetails ArticlePubMed