BDBM50006062 3-{3-[(3-Hexadecyloxy-2-methoxy-propoxy)-hydroxy-phosphoryloxy]-benzyl}-4,5-dimethyl-thiazol-3-ium::CHEMBL44110
SMILES CCCCCCCCCCCCCCCCOCC(COP([O-])(=O)Oc1cccc(C[n+]2csc(C)c2C)c1)OC
InChI Key InChIKey=FZSSGWOJRFTTNN-UHFFFAOYSA-N
Data  1 IC50
  Tab Delimited (TSV)   2D SDfile   Computed 3D by Vconf -m prep SDfile
Find this compound or compounds like it in BindingDB:
Activity Spreadsheet -- Enzyme Inhibition Constant Data from BindingDB
Found 1 hit for monomerid = 50006062
TargetPlatelet-activating factor receptor(Cavia porcellus)
American Cyanamid
Curated by ChEMBL
LigandPNGBDBM50006062(3-{3-[(3-Hexadecyloxy-2-methoxy-propoxy)-hydroxy-p...)
Affinity DataIC50:  1.31E+3nM. Assay description: Inhibition of PAF induced platelet aggregation in rabbit
In DepthDetails ArticlePubMed