BDBM50014717 CHEMBL3262026::US10759791, Compound 8R::US9951014, Name 8R
SMILES Cc1cc(N)nc(CCc2cncc(c2)[C@H](CN)Cc2cc(C)cc(N)n2)c1
InChI Key InChIKey=HKLFDCGBVFYQPQ-KRWDZBQOSA-N
Data  9 KI
PDB links: 3 PDB IDs match this monomer.
  Tab Delimited (TSV)   2D SDfile   Computed 3D by Vconf -m prep SDfile
Find this compound or compounds like it in BindingDB:
Activity Spreadsheet -- Enzyme Inhibition Constant Data from BindingDB
Found 9 hits for monomerid = 50014717
TargetNitric oxide synthase, brain(Homo sapiens (Human))
Northwestern University
US Patent
LigandPNGBDBM50014717(CHEMBL3262026 | US10759791, Compound 8R | US995101...)
Affinity DataKi:  24nM. Assay description: The NOSs isoform assays involved subjecting 3-8 to an oxyhemoglobin NO capture assay using a Biotek Gen5™ microplate reader. IC50 values for each com...
TargetNitric oxide synthase, brain(Rattus norvegicus (rat))
Northwestern University
Curated by ChEMBL
LigandPNGBDBM50014717(CHEMBL3262026 | US10759791, Compound 8R | US995101...)
Affinity DataKi:  24nM. Assay description: Inhibition of purified rat nNOS assessed as inhibition of nitric oxide-mediated oxidation of hemoglobin-A by hemoglobin capture assay
TargetNitric oxide synthase, brain(Rattus norvegicus (rat))
Northwestern University
Curated by ChEMBL
LigandPNGBDBM50014717(CHEMBL3262026 | US10759791, Compound 8R | US995101...)
Affinity DataKi:  24nM. Assay description: Enzyme inhibition was evaluated by measuring NO production with the hemoglobin capture assay, which was performed with purified NOSs in 96-well plate...
TargetNitric oxide synthase, inducible(Mus musculus (mouse))
Northwestern University
Curated by ChEMBL
LigandPNGBDBM50014717(CHEMBL3262026 | US10759791, Compound 8R | US995101...)
Affinity DataKi:  6.63E+3nM. Assay description: Inhibition of purified mouse iNOS assessed as inhibition of nitric oxide-mediated oxidation of hemoglobin-A by hemoglobin capture assay
TargetNitric oxide synthase, inducible(Homo sapiens (Human))
Northwestern University
US Patent
LigandPNGBDBM50014717(CHEMBL3262026 | US10759791, Compound 8R | US995101...)
Affinity DataKi:  6.63E+3nM. Assay description: The NOSs isoform assays involved subjecting 3-8 to an oxyhemoglobin NO capture assay using a Biotek Gen5™ microplate reader. IC50 values for each com...
TargetNitric oxide synthase, inducible(Mus musculus (mouse))
Northwestern University
Curated by ChEMBL
LigandPNGBDBM50014717(CHEMBL3262026 | US10759791, Compound 8R | US995101...)
Affinity DataKi:  6.63E+3nM. Assay description: Enzyme inhibition was evaluated by measuring NO production with the hemoglobin capture assay, which was performed with purified NOSs in 96-well plate...
TargetNitric oxide synthase, endothelial(Bos taurus (bovine))
Northwestern University
Curated by ChEMBL
LigandPNGBDBM50014717(CHEMBL3262026 | US10759791, Compound 8R | US995101...)
Affinity DataKi:  6.85E+4nM. Assay description: Inhibition of purified bovine eNOS assessed as inhibition of nitric oxide-mediated oxidation of hemoglobin-A by hemoglobin capture assay
TargetNitric oxide synthase, endothelial(Homo sapiens (Human))
Northwestern University
US Patent
LigandPNGBDBM50014717(CHEMBL3262026 | US10759791, Compound 8R | US995101...)
Affinity DataKi:  6.85E+4nM. Assay description: The NOSs isoform assays involved subjecting 3-8 to an oxyhemoglobin NO capture assay using a Biotek Gen5™ microplate reader. IC50 values for each com...
TargetNitric oxide synthase, endothelial(Bos taurus (bovine))
Northwestern University
Curated by ChEMBL
LigandPNGBDBM50014717(CHEMBL3262026 | US10759791, Compound 8R | US995101...)
Affinity DataKi:  6.85E+4nM. Assay description: Enzyme inhibition was evaluated by measuring NO production with the hemoglobin capture assay, which was performed with purified NOSs in 96-well plate...