BDBM50015490 CHEMBL438945::H-YPSKPDNPGEDAPAEDMARYYSALRHYINLITRQRY-NH2::NPY::NPY, human::NPY, human, rat::Tyr-Pro-Ser-Lys-Pro-Asp-Asn-Pro-Gly-Glu-Asp-Ala-Pro- Ala-Glu-Asp-Met-Ala-Arg-Tyr-Tyr-Ser-Ala-Leu-Arg-His- Tyr-Ile-Asn-Leu-Ile-Thr-Arg-Gln-Arg-Tyr-NH2 (NPY)::human Neuropeptide Y
SMILES CC[C@H](C)[C@H](NC(=O)[C@H](Cc1ccc(O)cc1)NC(=O)[C@H](Cc1c[nH]cn1)NC(=O)[C@H](CCCN=C(N)N)NC(=O)[C@H](CC(C)C)NC(=O)[C@H](C)NC(=O)[C@H](CO)NC(=O)[C@H](Cc1ccc(O)cc1)NC(=O)[C@H](Cc1ccc(O)cc1)NC(=O)[C@H](CCCN=C(N)N)NC(=O)[C@H](C)NC(=O)[C@H](CCSC)NC(=O)[C@H](CC(O)=O)NC(=O)[C@H](CCC(O)=O)NC(=O)[C@H](C)NC(=O)[C@@H]1CCCN1C(=O)[C@H](C)NC(=O)[C@H](CC(O)=O)NC(=O)[C@H](CCC(O)=O)NC(=O)CNC(=O)[C@@H]1CCCN1C(=O)[C@H](CC(N)=O)NC(=O)[C@H](CC(O)=O)NC(=O)[C@@H]1CCCN1C(=O)[C@H](CCCCN)NC(=O)[C@H](CO)NC(=O)[C@@H]1CCCN1C(=O)[C@@H](N)Cc1ccc(O)cc1)C(=O)N[C@@H](CC(N)=O)C(=O)N[C@@H](CC(C)C)C(=O)N[C@@H]([C@@H](C)CC)C(=O)N[C@@H]([C@@H](C)O)C(=O)N[C@@H](CCCN=C(N)N)C(=O)N[C@@H](CCC(N)=O)C(=O)N[C@@H](CCCN=C(N)N)C(=O)N[C@@H](Cc1ccc(O)cc1)C(N)=O
InChI Key InChIKey=XKWCTHKJQNUFOQ-HRPSIEBRSA-N
Data  32 KI  9 IC50  1 EC50
  Tab Delimited (TSV)   2D SDfile   Computed 3D by Vconf -m prep SDfile
Find this compound or compounds like it in BindingDB:
Activity Spreadsheet -- Enzyme Inhibition Constant Data from BindingDB
Found 42 hits for monomerid = 50015490
TargetNeuropeptide Y receptor type 2(Homo sapiens (Human))
Federal Institute of Technology of Zurich
Curated by PDSP Ki Database
LigandPNGBDBM50015490(CHEMBL438945 | H-YPSKPDNPGEDAPAEDMARYYSALRHYINLITR...)
Affinity DataKi:  0.0400nM
In DepthDetails ArticlePubMed
TargetNeuropeptide Y receptor type 2(Homo sapiens (Human))
Federal Institute of Technology of Zurich
Curated by PDSP Ki Database
LigandPNGBDBM50015490(CHEMBL438945 | H-YPSKPDNPGEDAPAEDMARYYSALRHYINLITR...)
Affinity DataKi:  0.0760nM. Assay description: Binding affinity to human neuropeptide Y receptor type 2 by radioligand displacement assay
In DepthDetails ArticlePubMed
TargetNeuropeptide Y receptor type 1(Homo sapiens (Human))
Synaptic Pharmaceutical
Curated by PDSP Ki Database
LigandPNGBDBM50015490(CHEMBL438945 | H-YPSKPDNPGEDAPAEDMARYYSALRHYINLITR...)
Affinity DataKi:  0.0800nM
In DepthDetails ArticlePubMed
TargetNeuropeptide Y receptor type 1(Homo sapiens (Human))
Synaptic Pharmaceutical
Curated by PDSP Ki Database
LigandPNGBDBM50015490(CHEMBL438945 | H-YPSKPDNPGEDAPAEDMARYYSALRHYINLITR...)
Affinity DataKi:  0.0900nM
In DepthDetails ArticlePubMed
TargetNeuropeptide Y receptor type 1(Homo sapiens (Human))
Synaptic Pharmaceutical
Curated by PDSP Ki Database
LigandPNGBDBM50015490(CHEMBL438945 | H-YPSKPDNPGEDAPAEDMARYYSALRHYINLITR...)
Affinity DataKi:  0.0900nM
In DepthDetails PubMed
TargetNeuropeptide Y receptor type 1(Homo sapiens (Human))
Synaptic Pharmaceutical
Curated by PDSP Ki Database
LigandPNGBDBM50015490(CHEMBL438945 | H-YPSKPDNPGEDAPAEDMARYYSALRHYINLITR...)
Affinity DataKi:  0.0960nM. Assay description: Binding affinity to human neuropeptide Y receptor type 1 by radioligand displacement assay
In DepthDetails ArticlePubMed
TargetNeuropeptide Y receptor type 1(Homo sapiens (Human))
Synaptic Pharmaceutical
Curated by PDSP Ki Database
LigandPNGBDBM50015490(CHEMBL438945 | H-YPSKPDNPGEDAPAEDMARYYSALRHYINLITR...)
Affinity DataKi:  0.210nM. Assay description: Displacement of [125I]Peptide YY from neuropeptide Y receptor type 1 in human SK-N-MC cells after 60 mins
In DepthDetails ArticlePubMed
TargetNeuropeptide Y receptor type 1(Homo sapiens (Human))
Synaptic Pharmaceutical
Curated by PDSP Ki Database
LigandPNGBDBM50015490(CHEMBL438945 | H-YPSKPDNPGEDAPAEDMARYYSALRHYINLITR...)
Affinity DataKi:  0.230nM
In DepthDetails ArticlePubMed
TargetNeuropeptide Y receptor type 1(Homo sapiens (Human))
Synaptic Pharmaceutical
Curated by PDSP Ki Database
LigandPNGBDBM50015490(CHEMBL438945 | H-YPSKPDNPGEDAPAEDMARYYSALRHYINLITR...)
Affinity DataKi:  0.280nM
In DepthDetails PubMed
LigandPNGBDBM50015490(CHEMBL438945 | H-YPSKPDNPGEDAPAEDMARYYSALRHYINLITR...)
Affinity DataKi:  0.420nM
In DepthDetails ArticlePubMed
LigandPNGBDBM50015490(CHEMBL438945 | H-YPSKPDNPGEDAPAEDMARYYSALRHYINLITR...)
Affinity DataKi:  0.490nM
In DepthDetails ArticlePubMed
LigandPNGBDBM50015490(CHEMBL438945 | H-YPSKPDNPGEDAPAEDMARYYSALRHYINLITR...)
Affinity DataKi:  0.5nM
In DepthDetails ArticlePubMed
TargetNeuropeptide Y receptor type 1(Homo sapiens (Human))
Synaptic Pharmaceutical
Curated by PDSP Ki Database
LigandPNGBDBM50015490(CHEMBL438945 | H-YPSKPDNPGEDAPAEDMARYYSALRHYINLITR...)
Affinity DataKi:  0.5nM. Assay description: Displacement of Cy5-pNPY from human Y1 receptor expressed in HEL cells after 90 to 120 mins by flow cytometry
In DepthDetails ArticlePubMed
TargetNeuropeptide Y receptor type 2(Homo sapiens (Human))
Federal Institute of Technology of Zurich
Curated by PDSP Ki Database
LigandPNGBDBM50015490(CHEMBL438945 | H-YPSKPDNPGEDAPAEDMARYYSALRHYINLITR...)
Affinity DataKi:  0.530nM
In DepthDetails ArticlePubMed
TargetNeuropeptide Y receptor type 2(Homo sapiens (Human))
Federal Institute of Technology of Zurich
Curated by PDSP Ki Database
LigandPNGBDBM50015490(CHEMBL438945 | H-YPSKPDNPGEDAPAEDMARYYSALRHYINLITR...)
Affinity DataKi:  0.540nM
In DepthDetails PubMed
TargetNeuropeptide Y receptor type 5(Homo sapiens (Human))
Federal Institute of Technology of Zurich
Curated by PDSP Ki Database
LigandPNGBDBM50015490(CHEMBL438945 | H-YPSKPDNPGEDAPAEDMARYYSALRHYINLITR...)
Affinity DataKi:  0.600nM
In DepthDetails ArticlePubMed
TargetNeuropeptide Y receptor type 5(Homo sapiens (Human))
Federal Institute of Technology of Zurich
Curated by PDSP Ki Database
LigandPNGBDBM50015490(CHEMBL438945 | H-YPSKPDNPGEDAPAEDMARYYSALRHYINLITR...)
Affinity DataKi:  0.730nM
In DepthDetails ArticlePubMed
LigandPNGBDBM50015490(CHEMBL438945 | H-YPSKPDNPGEDAPAEDMARYYSALRHYINLITR...)
Affinity DataKi:  0.790nM
In DepthDetails ArticlePubMed
TargetNeuropeptide Y receptor type 2(Homo sapiens (Human))
Federal Institute of Technology of Zurich
Curated by PDSP Ki Database
LigandPNGBDBM50015490(CHEMBL438945 | H-YPSKPDNPGEDAPAEDMARYYSALRHYINLITR...)
Affinity DataKi:  0.800nM. Assay description: Displacement of Cy5-pNPY from human Y2 receptor expressed in CHO cells after 90 to 120 mins by flow cytometry
In DepthDetails ArticlePubMed
TargetNeuropeptide Y receptor type 2(Homo sapiens (Human))
Federal Institute of Technology of Zurich
Curated by PDSP Ki Database
LigandPNGBDBM50015490(CHEMBL438945 | H-YPSKPDNPGEDAPAEDMARYYSALRHYINLITR...)
Affinity DataKi:  1.20nM
In DepthDetails PubMed
TargetNeuropeptide Y receptor type 5(Homo sapiens (Human))
Federal Institute of Technology of Zurich
Curated by PDSP Ki Database
LigandPNGBDBM50015490(CHEMBL438945 | H-YPSKPDNPGEDAPAEDMARYYSALRHYINLITR...)
Affinity DataKi:  1.5nM
In DepthDetails PubMed
TargetNeuropeptide Y receptor type 2(MOUSE)
Merck Research Laboratories
Curated by PDSP Ki Database
LigandPNGBDBM50015490(CHEMBL438945 | H-YPSKPDNPGEDAPAEDMARYYSALRHYINLITR...)
Affinity DataKi:  1.80nM
In DepthDetails ArticlePubMed
TargetNeuropeptide Y receptor type 4(Homo sapiens (Human))
Synaptic Pharmaceutical
Curated by PDSP Ki Database
LigandPNGBDBM50015490(CHEMBL438945 | H-YPSKPDNPGEDAPAEDMARYYSALRHYINLITR...)
Affinity DataKi:  2.08nM
In DepthDetails ArticlePubMed
TargetNeuropeptide Y receptor type 5(Homo sapiens (Human))
Federal Institute of Technology of Zurich
Curated by PDSP Ki Database
LigandPNGBDBM50015490(CHEMBL438945 | H-YPSKPDNPGEDAPAEDMARYYSALRHYINLITR...)
Affinity DataKi:  2.20nM. Assay description: Displacement of Cy5-pNPY from human Y5 receptor expressed in human HEC-1B cells after 90 to 120 mins by flow cytometry
In DepthDetails ArticlePubMed
TargetNeuropeptide Y receptor type 2(Homo sapiens (Human))
Federal Institute of Technology of Zurich
Curated by PDSP Ki Database
LigandPNGBDBM50015490(CHEMBL438945 | H-YPSKPDNPGEDAPAEDMARYYSALRHYINLITR...)
Affinity DataKi:  2.30nM
In DepthDetails ArticlePubMed
TargetNeuropeptide Y receptor type 2(Homo sapiens (Human))
Federal Institute of Technology of Zurich
Curated by PDSP Ki Database
LigandPNGBDBM50015490(CHEMBL438945 | H-YPSKPDNPGEDAPAEDMARYYSALRHYINLITR...)
Affinity DataKi:  3.20nM
In DepthDetails ArticlePubMed
TargetNeuropeptide Y receptor type 5(Mus musculus (Mouse))
Merck Research Laboratories
Curated by PDSP Ki Database
LigandPNGBDBM50015490(CHEMBL438945 | H-YPSKPDNPGEDAPAEDMARYYSALRHYINLITR...)
Affinity DataKi:  4.30nM
In DepthDetails ArticlePubMed
TargetNeuropeptide Y receptor type 4(Homo sapiens (Human))
Synaptic Pharmaceutical
Curated by PDSP Ki Database
LigandPNGBDBM50015490(CHEMBL438945 | H-YPSKPDNPGEDAPAEDMARYYSALRHYINLITR...)
Affinity DataKi:  5.80nM
In DepthDetails ArticlePubMed
TargetNeuropeptide Y receptor type 4(Homo sapiens (Human))
Synaptic Pharmaceutical
Curated by PDSP Ki Database
LigandPNGBDBM50015490(CHEMBL438945 | H-YPSKPDNPGEDAPAEDMARYYSALRHYINLITR...)
Affinity DataKi:  282nM. Assay description: Displacement of Cy5-[K4]hPP from human Y4 receptor expressed in CHO cells after 90 to 120 mins by flow cytometry
In DepthDetails ArticlePubMed
TargetPro-FMRFamide-related neuropeptide FF(RAT)
Juvantia Pharma
Curated by PDSP Ki Database
LigandPNGBDBM50015490(CHEMBL438945 | H-YPSKPDNPGEDAPAEDMARYYSALRHYINLITR...)
Affinity DataKi:  920nM
In DepthDetails ArticlePubMed
TargetPro-neuropeptide Y(RAT)
Amgen
Curated by PDSP Ki Database
LigandPNGBDBM50015490(CHEMBL438945 | H-YPSKPDNPGEDAPAEDMARYYSALRHYINLITR...)
Affinity DataKi:  1.00E+3nM
In DepthDetails ArticlePubMed
TargetNeuropeptide FF receptor 2(RAT)
Juvantia Pharma
Curated by PDSP Ki Database
LigandPNGBDBM50015490(CHEMBL438945 | H-YPSKPDNPGEDAPAEDMARYYSALRHYINLITR...)
Affinity DataKi:  4.00E+3nM
In DepthDetails ArticlePubMed
TargetNeuropeptide Y receptor type 1(Homo sapiens (Human))
Synaptic Pharmaceutical
Curated by PDSP Ki Database
LigandPNGBDBM50015490(CHEMBL438945 | H-YPSKPDNPGEDAPAEDMARYYSALRHYINLITR...)
Affinity DataIC50:  1.20nM. Assay description: Inhibition of neuropeptide Y1 receptor in human SK-N-MC cells after 60 mins by scintillation counting
In DepthDetails ArticlePubMed
TargetNeuropeptide Y receptor type 2(Homo sapiens (Human))
Federal Institute of Technology of Zurich
Curated by PDSP Ki Database
LigandPNGBDBM50015490(CHEMBL438945 | H-YPSKPDNPGEDAPAEDMARYYSALRHYINLITR...)
Affinity DataIC50:  0.190nM. Assay description: Binding affinity to human neuropeptide Y receptor type 2 by radioligand displacement assay
In DepthDetails ArticlePubMed
TargetNeuropeptide Y receptor type 1(Homo sapiens (Human))
Synaptic Pharmaceutical
Curated by PDSP Ki Database
LigandPNGBDBM50015490(CHEMBL438945 | H-YPSKPDNPGEDAPAEDMARYYSALRHYINLITR...)
Affinity DataIC50:  0.140nM. Assay description: Binding affinity to human neuropeptide Y receptor type 1 by radioligand displacement assay
In DepthDetails ArticlePubMed
TargetNeuropeptide Y receptor type 1(Homo sapiens (Human))
Synaptic Pharmaceutical
Curated by PDSP Ki Database
LigandPNGBDBM50015490(CHEMBL438945 | H-YPSKPDNPGEDAPAEDMARYYSALRHYINLITR...)
Affinity DataIC50:  0.220nM. Assay description: Displacement of [125I]Peptide YY from neuropeptide Y receptor type 1 in human SK-N-MC cells after 60 mins
In DepthDetails ArticlePubMed
TargetNeuropeptide Y receptor type 1(Homo sapiens (Human))
Synaptic Pharmaceutical
Curated by PDSP Ki Database
LigandPNGBDBM50015490(CHEMBL438945 | H-YPSKPDNPGEDAPAEDMARYYSALRHYINLITR...)
Affinity DataIC50:  2.60nM. Assay description: Displacement of [125I]-NPY from Y1 receptor in human MCF7 cells in presence of 1 uM BBN
In DepthDetails ArticlePubMed
TargetNeuropeptide Y receptor type 5(Homo sapiens (Human))
Federal Institute of Technology of Zurich
Curated by PDSP Ki Database
LigandPNGBDBM50015490(CHEMBL438945 | H-YPSKPDNPGEDAPAEDMARYYSALRHYINLITR...)
Affinity DataIC50:  3nM. Assay description: Inhibition of [125I]-PYY binding to recombinant NPY Y5 receptor on HEK-293 cell membranes.
In DepthDetails ArticlePubMed
TargetNeuropeptide Y receptor type 2(Homo sapiens (Human))
Federal Institute of Technology of Zurich
Curated by PDSP Ki Database
LigandPNGBDBM50015490(CHEMBL438945 | H-YPSKPDNPGEDAPAEDMARYYSALRHYINLITR...)
Affinity DataIC50:  0.0900nM. Assay description: Binding affinity to human neuropeptide Y2 receptor by radioligand displacement assay
In DepthDetails ArticlePubMed
TargetNeuropeptide Y receptor type 4(Homo sapiens (Human))
Synaptic Pharmaceutical
Curated by PDSP Ki Database
LigandPNGBDBM50015490(CHEMBL438945 | H-YPSKPDNPGEDAPAEDMARYYSALRHYINLITR...)
Affinity DataEC50:  417nM. Assay description: Agonist activity at human Y4 receptor expressed in sf9 cells assessed as hydrolysis of [gamma-33P]GTP after 2 mins by scintillation counting analysis
In DepthDetails ArticlePubMed
TargetNeuropeptide Y receptor type 2(Homo sapiens (Human))
Federal Institute of Technology of Zurich
Curated by PDSP Ki Database
LigandPNGBDBM50015490(CHEMBL438945 | H-YPSKPDNPGEDAPAEDMARYYSALRHYINLITR...)
Affinity DataIC50:  0.5nM. Assay description: Compound was evaluated for its inhibitory activity against Y2 receptor of rabbit kidney membrane
In DepthDetails Article
TargetNeuropeptide Y receptor type 1(Homo sapiens (Human))
Synaptic Pharmaceutical
Curated by PDSP Ki Database
LigandPNGBDBM50015490(CHEMBL438945 | H-YPSKPDNPGEDAPAEDMARYYSALRHYINLITR...)
Affinity DataIC50:  0.0700nM. Assay description: Binding affinity to human neuropeptide Y1 receptor by radioligand displacement assay
In DepthDetails ArticlePubMed