BDBM50016747 1-[20-Benzyl-14-carbamoylmethyl-23-(4-ethoxy-benzyl)-17-isopropyl-13,16,19,22,25-pentaoxo-7,9-dithia-12,15,18,21,24-pentaaza-spiro[5.20]hexacosane-11-carbonyl]-pyrrolidine-2-carboxylic acid (2-amino-ethyl)-amide::CHEMBL2370642
SMILES CCOc1ccc(C[C@H]2NC(=O)CC3(CCCCC3)SCSC[C@@H](NC(=O)[C@@H](CC(N)=O)NC(=O)[C@@H](NC(=O)[C@@H](Cc3ccccc3)NC2=O)C(C)C)C(=O)N2CCC[C@H]2C(=O)NCCN)cc1
InChI Key InChIKey=PBKKTMNDHMKKAM-OHGCLKBRSA-N
Data  2 KI
  Tab Delimited (TSV)   2D SDfile   Computed 3D by Vconf -m prep SDfile
Find this compound or compounds like it in BindingDB:
Activity Spreadsheet -- Enzyme Inhibition Constant Data from BindingDB
Found 2 hits for monomerid = 50016747
TargetVasopressin V2 receptor(Sus scrofa)
Smith Kline & French Laboratories
Curated by ChEMBL
LigandPNGBDBM50016747(1-[20-Benzyl-14-carbamoylmethyl-23-(4-ethoxy-benzy...)
Affinity DataKi:  4.70nM. Assay description: Inhibition constant for vasopressin-stimulated adenylate cyclase of medullary membranes of pig kidney
In DepthDetails ArticlePubMed
TargetVasopressin V2 receptor(Homo sapiens (Human))
Smith Kline & French Laboratories
Curated by ChEMBL
LigandPNGBDBM50016747(1-[20-Benzyl-14-carbamoylmethyl-23-(4-ethoxy-benzy...)
Affinity DataKi:  4.80nM. Assay description: Inhibition constant for vasopressin-stimulated adenylate cyclase of medullary membranes of human kidney
In DepthDetails ArticlePubMed