BDBM50017109 CHEMBL36290::N-Butyl-4-[2-methoxy-5-(5-oxo-pyrrolidin-3-yl)-phenoxy]-butyramide
SMILES CCCCNC(=O)CCCOc1cc(ccc1OC)C1CNC(=O)C1
InChI Key InChIKey=YLZGZAHCELCJBB-UHFFFAOYSA-N
Data  3 IC50
  Tab Delimited (TSV)   2D SDfile   Computed 3D by Vconf -m prep SDfile
Find this compound or compounds like it in BindingDB:
Activity Spreadsheet -- Enzyme Inhibition Constant Data from BindingDB
Found 3 hits for monomerid = 50017109
TargetcGMP-specific 3',5'-cyclic phosphodiesterase(Bos taurus)
Centre De Neurochimie Du Cnrs
Curated by ChEMBL
LigandPNGBDBM50017109(CHEMBL36290 | N-Butyl-4-[2-methoxy-5-(5-oxo-pyrrol...)
Affinity DataIC50: >1.00E+6nM. Assay description: Inhibitory activity against phosphodiesterase was determined in vitro using bovine aorta, at 1 uM cGMP for cGMP-PDE.
In DepthDetails ArticlePubMed
LigandPNGBDBM50017109(CHEMBL36290 | N-Butyl-4-[2-methoxy-5-(5-oxo-pyrrol...)
Affinity DataIC50: >1.00E+6nM. Assay description: Inhibitory activity against phosphodiesterase was determined in vitro using bovine aorta, at 1 uM cGMP in the presence of calcium (10 uM) and calmodu...
In DepthDetails ArticlePubMed
TargetcAMP-specific 3',5'-cyclic phosphodiesterase 4A/4B/4C/4D(Homo sapiens (Human))
Centre De Neurochimie Du Cnrs
Curated by ChEMBL
LigandPNGBDBM50017109(CHEMBL36290 | N-Butyl-4-[2-methoxy-5-(5-oxo-pyrrol...)
Affinity DataIC50:  1.60E+4nM. Assay description: Inhibitory activity against phosphodiesterase was determined in vitro using bovine aorta, at 1 uM cAMP for cAMP-PDE.
In DepthDetails ArticlePubMed