BDBM50021208 CHEMBL545671::[3-(4-Bromo-phenyl)-indan-1-yl]-methyl-amine; hydrochloride
SMILES CNC1CC(c2ccccc12)c1ccc(Br)cc1
InChI Key InChIKey=UUESRGBQJQQURV-UHFFFAOYSA-N
Data  6 IC50
  Tab Delimited (TSV)   2D SDfile   Computed 3D by Vconf -m prep SDfile
Find this compound or compounds like it in BindingDB:
Activity Spreadsheet -- Enzyme Inhibition Constant Data from BindingDB
Found 6 hits for monomerid = 50021208
TargetSodium-dependent serotonin transporter(Rattus norvegicus (rat))
TBA
Curated by ChEMBL
LigandPNGBDBM50021208(CHEMBL545671 | [3-(4-Bromo-phenyl)-indan-1-yl]-met...)
Affinity DataIC50:  0.280nM. Assay description: Inhibition of 5-HT uptake in rat synaptosomal fraction
In DepthDetails ArticlePubMed
TargetSodium-dependent dopamine transporter(Rattus norvegicus (rat))
TBA
Curated by ChEMBL
LigandPNGBDBM50021208(CHEMBL545671 | [3-(4-Bromo-phenyl)-indan-1-yl]-met...)
Affinity DataIC50:  2.5nM. Assay description: Inhibition of dopamine uptake in rat synaptosomal fraction
In DepthDetails ArticlePubMed
TargetTransporter(Rattus norvegicus)
TBA
Curated by ChEMBL
LigandPNGBDBM50021208(CHEMBL545671 | [3-(4-Bromo-phenyl)-indan-1-yl]-met...)
Affinity DataIC50:  0.300nM. Assay description: Inhibition of noradrenaline uptake in rat synaptosomal fraction
In DepthDetails ArticlePubMed
TargetSodium-dependent serotonin transporter(Rattus norvegicus (rat))
TBA
Curated by ChEMBL
LigandPNGBDBM50021208(CHEMBL545671 | [3-(4-Bromo-phenyl)-indan-1-yl]-met...)
Affinity DataIC50:  0.280nM. Assay description: Inhibition of 5-HT uptake in rat synaptosomal fraction
In DepthDetails ArticlePubMed
TargetSodium-dependent dopamine transporter(Rattus norvegicus (rat))
TBA
Curated by ChEMBL
LigandPNGBDBM50021208(CHEMBL545671 | [3-(4-Bromo-phenyl)-indan-1-yl]-met...)
Affinity DataIC50:  2.5nM. Assay description: Inhibition of noradrenaline uptake in rat synaptosomal fraction
In DepthDetails ArticlePubMed
TargetTransporter(Rattus norvegicus)
TBA
Curated by ChEMBL
LigandPNGBDBM50021208(CHEMBL545671 | [3-(4-Bromo-phenyl)-indan-1-yl]-met...)
Affinity DataIC50:  0.300nM. Assay description: Inhibition of noradrenaline uptake in rat synaptosomal fraction
In DepthDetails ArticlePubMed