BDBM50022476 2'-methylspiro[tetrahydro-1H-imidazole-4,1'-(1',2',3',4'-tetrahydronaphthalene)]-2,5-dione::CHEMBL78544
SMILES CC1CCc2ccccc2C11NC(=O)NC1=O
InChI Key InChIKey=JWSJBOYHIMGMRF-UHFFFAOYSA-N
Data  1 IC50
  Tab Delimited (TSV)   2D SDfile   Computed 3D by Vconf -m prep SDfile
Find this compound or compounds like it in BindingDB:
Activity Spreadsheet -- Enzyme Inhibition Constant Data from BindingDB
Found 1 hit for monomerid = 50022476
TargetAldo-keto reductase family 1 member B1 [K65Q](Bos taurus (Cattle))
Pfizer
Curated by ChEMBL
LigandPNGBDBM50022476(2'-methylspiro[tetrahydro-1H-imidazole-4,1'-(1',2'...)
Affinity DataIC50:  1.00E+5nM. Assay description: In vitro inhibition of partially purified calf lens aldose reductase
In DepthDetails ArticlePubMed