BDBM50024019 2-[(2,2-Dimethyl-cyclopropanecarbonyl)-amino]-oct-2-enedioic acid::CHEMBL12095
SMILES CC1(C)CC1C(=O)N\C(=C/CCCCC(O)=O)C(O)=O
InChI Key InChIKey=CUFUWAFSUDBWIP-POHAHGRESA-N
Data  1 KI
  Tab Delimited (TSV)   2D SDfile   Computed 3D by Vconf -m prep SDfile
Find this compound or compounds like it in BindingDB:
Activity Spreadsheet -- Enzyme Inhibition Constant Data from BindingDB
Found 1 hit for monomerid = 50024019
TargetDipeptidase 1(GUINEA PIG)
TBA
Curated by ChEMBL
LigandPNGBDBM50024019(2-[(2,2-Dimethyl-cyclopropanecarbonyl)-amino]-oct-...)
Affinity DataKi:  58nM. Assay description: Inhibitory activity against beta-lactamase renal dipeptidase
In DepthDetails ArticlePubMed