BDBM50024514 CHEMBL280558::Cyclopropyl-(4-methoxy-phenyl)-pyrimidin-5-yl-methanol
SMILES COc1ccc(cc1)C(O)(C1CC1)c1cncnc1
InChI Key InChIKey=HUTDUHSNJYTCAR-UHFFFAOYSA-N
Data  1 EC50
PDB links: 1 PDB ID matches this monomer.
  Tab Delimited (TSV)   2D SDfile   Computed 3D by Vconf -m prep SDfile
Find this compound or compounds like it in BindingDB:
Activity Spreadsheet -- Enzyme Inhibition Constant Data from BindingDB
Found 1 hit for monomerid = 50024514
TargetAromatase(Rattus norvegicus)
TBA
Curated by ChEMBL
LigandPNGBDBM50024514(CHEMBL280558 | Cyclopropyl-(4-methoxy-phenyl)-pyri...)
Affinity DataEC50: >2.00E+3nM. Assay description: In vitro inhibition of cytochrome P450 19A1 by rat ovarian microsomes incubated with [3H]androstenedione and NADPH-generating system.
In DepthDetails ArticlePubMed