BDBM50028621 CHEMBL3342517
SMILES CN(C(=O)c1ccc(s1)-c1cccc(C)c1)c1cccc(Cl)c1
InChI Key InChIKey=RCHVMXLELLTODJ-UHFFFAOYSA-N
Data  2 IC50
  Tab Delimited (TSV)   2D SDfile   Computed 3D by Vconf -m prep SDfile
Find this compound or compounds like it in BindingDB:
Activity Spreadsheet -- Enzyme Inhibition Constant Data from BindingDB
Found 2 hits for monomerid = 50028621
Target17-beta-hydroxysteroid dehydrogenase type 1(Homo sapiens (Human))
Saarland University
Curated by ChEMBL
LigandPNGBDBM50028621(CHEMBL3342517)
Affinity DataIC50:  9.41E+3nM. Assay description: Displacement of [3H]E1 from human placental cytosolic17beta-HSD1 after 10 mins by cell-free assay
In DepthDetails ArticlePubMed
Target17-beta-hydroxysteroid dehydrogenase type 2(Homo sapiens (Human))
Saarland University
Curated by ChEMBL
LigandPNGBDBM50028621(CHEMBL3342517)
Affinity DataIC50:  327nM. Assay description: Displacement of [3H]E2 from human placental microsomal 17beta-HSD2 after 20 mins by cell-free assay
In DepthDetails ArticlePubMed