BDBM50029047 CHEMBL3343245
SMILES COc1ccc(OC[C@]2(C[C@H]2C(=O)N2CCCc3ccccc23)c2ccccc2)cc1OC
InChI Key InChIKey=KNZRGDMEJAEMIQ-NEKDWFFYSA-N
Data  2 KI
  Tab Delimited (TSV)   2D SDfile   Computed 3D by Vconf -m prep SDfile
Find this compound or compounds like it in BindingDB:
Activity Spreadsheet -- Enzyme Inhibition Constant Data from BindingDB
Found 2 hits for monomerid = 50029047
TargetOrexin/Hypocretin receptor type 1(Homo sapiens (Human))
Eisai
Curated by ChEMBL
LigandPNGBDBM50029047(CHEMBL3343245)
Affinity DataKi:  1.00E+4nM. Assay description: Displacement of [125I]-Orexin A from human OX1R expressed in CHO cells after 30 mins by topcount analysis
In DepthDetails ArticlePubMed
TargetOrexin receptor type 2(Homo sapiens (Human))
Eisai
Curated by ChEMBL
LigandPNGBDBM50029047(CHEMBL3343245)
Affinity DataKi: >1.00E+4nM. Assay description: Displacement of [125I]-Orexin A from human OX2R expressed in CHO cells after 30 mins by topcount analysis
In DepthDetails ArticlePubMed