BDBM50030432 CHEMBL305608::N-[(S)-1-[(3,5-Dimethyl-benzyl)-methyl-carbamoyl]-2-(1H-indol-3-yl)-ethyl]-benzamide
SMILES CN(Cc1cc(C)cc(C)c1)C(=O)[C@H](Cc1c[nH]c2ccccc12)NC(=O)c1ccccc1
InChI Key InChIKey=KWYBCHYLXFETGY-SANMLTNESA-N
Data  3 IC50
  Tab Delimited (TSV)   2D SDfile   Computed 3D by Vconf -m prep SDfile
Find this compound or compounds like it in BindingDB:
Activity Spreadsheet -- Enzyme Inhibition Constant Data from BindingDB
Found 3 hits for monomerid = 50030432
TargetSubstance-P receptor(Homo sapiens (Human))
Merck Sharp & Dohme Research Laboratories
Curated by ChEMBL
LigandPNGBDBM50030432(CHEMBL305608 | N-[(S)-1-[(3,5-Dimethyl-benzyl)-met...)
Affinity DataIC50:  1.03E+3nM. Assay description: Binding affinity against human Tachykinin receptor 1 expressed in CHO cells was measured by its ability to displace [125I]- Tyr-8 substance P.
In DepthDetails ArticlePubMed
TargetSubstance-P receptor(Homo sapiens (Human))
Merck Sharp & Dohme Research Laboratories
Curated by ChEMBL
LigandPNGBDBM50030432(CHEMBL305608 | N-[(S)-1-[(3,5-Dimethyl-benzyl)-met...)
Affinity DataIC50: >1.10E+3nM. Assay description: Inhibition of cloned human NK1 (Neurokinin 1) receptor, stably expressed in chinese hamster ovary (CHO) cells was determined
In DepthDetails ArticlePubMed
TargetSubstance-K receptor(Homo sapiens (Human))
Merck Research Laboratories
Curated by ChEMBL
LigandPNGBDBM50030432(CHEMBL305608 | N-[(S)-1-[(3,5-Dimethyl-benzyl)-met...)
Affinity DataIC50: >5.00E+3nM. Assay description: Inhibition of cloned human NK2 (Neurokinin 2) receptor, stably expressed in chinese hamster ovary (CHO) cells was determined
In DepthDetails ArticlePubMed