BDBM50034663 CHEMBL3360940
SMILES Cc1ccc(Cn2nc3c(cn(Cc4ccc(F)cc4)c4ccccc34)c2=O)c(C)c1
InChI Key InChIKey=IBLRWYQEZFHXMI-UHFFFAOYSA-N
Data  2 EC50
  Tab Delimited (TSV)   2D SDfile   Computed 3D by Vconf -m prep SDfile
Find this compound or compounds like it in BindingDB:
Activity Spreadsheet -- Enzyme Inhibition Constant Data from BindingDB
Found 2 hits for monomerid = 50034663
TargetMuscarinic acetylcholine receptor M1(Homo sapiens (Human))
Vanderbilt University Medical Center
Curated by ChEMBL
LigandPNGBDBM50034663(CHEMBL3360940)
Affinity DataEC50:  2.04E+3nM. Assay description: Positive allosteric modulator activity at human muscarinic receptor subtype 1 expressed in CHO-K1 cells by calcium mobilization assay
In DepthDetails ArticlePubMed
TargetMuscarinic acetylcholine receptor M1(Homo sapiens (Human))
Vanderbilt University Medical Center
Curated by ChEMBL
LigandPNGBDBM50034663(CHEMBL3360940)
Affinity DataEC50:  2.02E+3nM. Assay description: Positive allosteric modulator activity at human muscarinic receptor subtype 1 expressed in CHO-K1 cells by calcium mobilization assay
In DepthDetails ArticlePubMed