BDBM50035854 CHEMBL3360487
SMILES COc1cc2CCN(CCCCCCn3ccnc3\C=N\O)C(c3ccccc3)c2cc1OC
InChI Key InChIKey=BCLNLHPADHWIJF-ZTKZIYFRSA-N
Data  1 IC50  3 Kd
  Tab Delimited (TSV)   2D SDfile   Computed 3D by Vconf -m prep SDfile
Find this compound or compounds like it in BindingDB:
Activity Spreadsheet -- Enzyme Inhibition Constant Data from BindingDB
Found 4 hits for monomerid = 50035854
TargetAcetylcholinesterase(Homo sapiens (Human))
Institute Of Pharmacology And Toxicology
Curated by ChEMBL
LigandPNGBDBM50035854(CHEMBL3360487)
Affinity DataKd:  4.10E+4nM. Assay description: Reactivation of sarin-inhibited human acetylcholinesterase assessed as dissociation constant
In DepthDetails ArticlePubMed
TargetAcetylcholinesterase(Homo sapiens (Human))
Institute Of Pharmacology And Toxicology
Curated by ChEMBL
LigandPNGBDBM50035854(CHEMBL3360487)
Affinity DataIC50:  8.70E+5nM. Assay description: Inhibition of human acetylcholinesterase by Ellman's method
In DepthDetails ArticlePubMed
TargetAcetylcholinesterase(Homo sapiens (Human))
Institute Of Pharmacology And Toxicology
Curated by ChEMBL
LigandPNGBDBM50035854(CHEMBL3360487)
Affinity DataKd:  1.40E+4nM. Assay description: Reactivation of tabun-inhibited human acetylcholinesterase assessed as dissociation constant
In DepthDetails ArticlePubMed
TargetAcetylcholinesterase(Homo sapiens (Human))
Institute Of Pharmacology And Toxicology
Curated by ChEMBL
LigandPNGBDBM50035854(CHEMBL3360487)
Affinity DataKd:  2.50E+4nM. Assay description: Reactivation of VX-inhibited human acetylcholinesterase assessed as dissociation constant
In DepthDetails ArticlePubMed