BDBM50036831 6-Amino-2-mercapto-hexanoic acid::CHEMBL432852
SMILES NCCCCC(S)C(O)=O
InChI Key InChIKey=JNQDJHCXDRGZJD-UHFFFAOYSA-N
Data  1 KI
  Tab Delimited (TSV)   2D SDfile   Computed 3D by Vconf -m prep SDfile
Find this compound or compounds like it in BindingDB:
Activity Spreadsheet -- Enzyme Inhibition Constant Data from BindingDB
Found 1 hit for monomerid = 50036831
TargetAminopeptidase B(Homo sapiens (Human))
University Of Paris
Curated by ChEMBL
LigandPNGBDBM50036831(6-Amino-2-mercapto-hexanoic acid | CHEMBL432852)
Affinity DataKi:  0.900nM. Assay description: Inhibition of arginylaminopeptidase (aminopeptidase B)
In DepthDetails ArticlePubMed