BDBM50040332 CHEMBL3360057
SMILES O=C(CCCCc1ccccc1)n1sc2ccccc2c1=O
InChI Key InChIKey=GQXBVBOSGIYTNU-UHFFFAOYSA-N
Data  2 IC50
  Tab Delimited (TSV)   2D SDfile   Computed 3D by Vconf -m prep SDfile
Find this compound or compounds like it in BindingDB:
Activity Spreadsheet -- Enzyme Inhibition Constant Data from BindingDB
Found 2 hits for monomerid = 50040332
TargetCaspase-3(Homo sapiens (Human))
TBA
Curated by ChEMBL
LigandPNGBDBM50040332(CHEMBL3360057)
Affinity DataIC50:  306nM. Assay description: Inhibition of recombinant human caspase-3 activity using Ac-DEVD-AMC as substrate preincubated for 10 mins by fluorescence assay
In DepthDetails ArticlePubMed
TargetCaspase-7(Homo sapiens (Human))
TBA
Curated by ChEMBL
LigandPNGBDBM50040332(CHEMBL3360057)
Affinity DataIC50:  101nM. Assay description: Inhibition of recombinant human caspase-7 activity using Ac-DEVD-AMC as substrate preincubated for 10 mins by fluorescence assay
In DepthDetails ArticlePubMed