BDBM50041717 4-Pentanoyl-thiophene-2-sulfonic acid amide::CHEMBL297821
SMILES CCCCC(=O)c1csc(c1)S(N)(=O)=O
InChI Key InChIKey=DKLJICMKPVFEQM-UHFFFAOYSA-N
Data  1 IC50
  Tab Delimited (TSV)   2D SDfile   Computed 3D by Vconf -m prep SDfile
Find this compound or compounds like it in BindingDB:
Activity Spreadsheet -- Enzyme Inhibition Constant Data from BindingDB
Found 1 hit for monomerid = 50041717
TargetCarbonic anhydrase 2(Homo sapiens (Human))
Allergan
Curated by ChEMBL
LigandPNGBDBM50041717(4-Pentanoyl-thiophene-2-sulfonic acid amide | CHEM...)
Affinity DataIC50:  6.30nM. Assay description: Activity against human carbonic anhydrase II
In DepthDetails ArticlePubMed