BDBM50045439 CHEMBL3309801
SMILES [O-][N+](=O)c1ccc(cc1)C1CC(=NN1)c1ccccc1
InChI Key InChIKey=XMRZVIWVCOLQOA-UHFFFAOYSA-N
Data  2 KI  1 IC50
  Tab Delimited (TSV)   2D SDfile   Computed 3D by Vconf -m prep SDfile
Find this compound or compounds like it in BindingDB:
Activity Spreadsheet -- Enzyme Inhibition Constant Data from BindingDB
Found 3 hits for monomerid = 50045439
TargetCathepsin B(Capra hircus (Goat))
Kurukshetra University
Curated by ChEMBL
LigandPNGBDBM50045439(CHEMBL3309801)
Affinity DataKi:  131nM. Assay description: Competitive inhibition of goat liver cathepsin B using BANA substrate by Lineweaver-Burk plot analysis
In DepthDetails ArticlePubMed
TargetCathepsin H(Capra hircus (Goat))
Kurukshetra University
Curated by ChEMBL
LigandPNGBDBM50045439(CHEMBL3309801)
Affinity DataKi:  3.33E+3nM. Assay description: Competitive inhibition of goat liver cathepsin H using Leu-betaNA substrate by Lineweaver-Burk plot analysis
In DepthDetails ArticlePubMed
TargetCathepsin B(Capra hircus (Goat))
Kurukshetra University
Curated by ChEMBL
LigandPNGBDBM50045439(CHEMBL3309801)
Affinity DataIC50:  740nM. Assay description: Inhibition of goat liver cathepsin B using BANA substrate pre-incubated 30 mins before substrate addition by colorimetry
In DepthDetails ArticlePubMed