BDBM50047130 CHEMBL280189::{2,6-Dimethyl-4-[2'-(1H-tetrazol-5-yl)-biphenyl-4-ylmethoxy]-pyridin-3-yl}-phenyl-methanone
SMILES Cc1cc(OCc2ccc(cc2)-c2ccccc2-c2nnn[nH]2)c(C(=O)c2ccccc2)c(C)n1
InChI Key InChIKey=DFTSRMZKJQYQHV-UHFFFAOYSA-N
Data  1 IC50
  Tab Delimited (TSV)   2D SDfile   Computed 3D by Vconf -m prep SDfile
Find this compound or compounds like it in BindingDB:
Activity Spreadsheet -- Enzyme Inhibition Constant Data from BindingDB
Found 1 hit for monomerid = 50047130
TargetType-1 angiotensin II receptor(Cavia porcellus)
Zeneca Pharmaceuticals
Curated by ChEMBL
LigandPNGBDBM50047130(CHEMBL280189 | {2,6-Dimethyl-4-[2'-(1H-tetrazol-5-...)
Affinity DataIC50:  6nM. Assay description: Inhibition of [125I]-Angiotensin binding to a guinea pig adrenal membrane preparation which corresponds to Angiotensin II receptor, type 1
In DepthDetails ArticlePubMed