BDBM50047789 2-{4-[3-butyl-5-(2-carboxybenzylsulfanyl)-4H-1,2,4-triazol-4-ylmethyl]phenylcarbamoyl}benzoic acid::CHEMBL345570
SMILES CCCCc1nnc(SCc2ccccc2C(O)=O)n1Cc1ccc(NC(=O)c2ccccc2C(O)=O)cc1
InChI Key InChIKey=GYMMKEUZHUBKQP-UHFFFAOYSA-N
Data  2 IC50
  Tab Delimited (TSV)   2D SDfile   Computed 3D by Vconf -m prep SDfile
Find this compound or compounds like it in BindingDB:
Activity Spreadsheet -- Enzyme Inhibition Constant Data from BindingDB
Found 2 hits for monomerid = 50047789
LigandPNGBDBM50047789(2-{4-[3-butyl-5-(2-carboxybenzylsulfanyl)-4H-1,2,4...)
Affinity DataIC50:  3.30nM. Assay description: Antagonist activity at AT1 receptor in Oryctolagus cuniculus (rabbit) aorta
In DepthDetails Article
LigandPNGBDBM50047789(2-{4-[3-butyl-5-(2-carboxybenzylsulfanyl)-4H-1,2,4...)
Affinity DataIC50:  3.30nM. Assay description: Displacement of [125I]-Sar1-Ile8-A II at the rabbit aorta angiotensin II receptor, type 1
In DepthDetails ArticlePubMed