BDBM50047875 CHEMBL347135::N-{4-[3-Butyl-5-(4-chloro-benzylsulfanyl)-[1,2,4]triazol-4-ylmethyl]-phenyl}-phthalamic acid
SMILES CCCCc1nnc(SCc2ccc(Cl)cc2)n1Cc1ccc(NC(=O)c2ccccc2C(O)=O)cc1
InChI Key InChIKey=IRLNKXAOESAHHJ-UHFFFAOYSA-N
Data  2 IC50
  Tab Delimited (TSV)   2D SDfile   Computed 3D by Vconf -m prep SDfile
Find this compound or compounds like it in BindingDB:
Activity Spreadsheet -- Enzyme Inhibition Constant Data from BindingDB
Found 2 hits for monomerid = 50047875
LigandPNGBDBM50047875(CHEMBL347135 | N-{4-[3-Butyl-5-(4-chloro-benzylsul...)
Affinity DataIC50:  6.80nM. Assay description: Antagonist activity at AT1 receptor in Oryctolagus cuniculus (rabbit) aorta
In DepthDetails Article
LigandPNGBDBM50047875(CHEMBL347135 | N-{4-[3-Butyl-5-(4-chloro-benzylsul...)
Affinity DataIC50:  6.80nM. Assay description: Displacement of [125I]-Sar1-Ile8-A II at the rabbit aorta angiotensin II receptor, type 1
In DepthDetails ArticlePubMed