BDBM50049031 5-(3,5-Dichloro-4-methoxy-phenyl)-6-(4-methanesulfonyl-phenyl)-spiro[2.4]hept-5-ene::CHEMBL315520
SMILES COc1c(Cl)cc(cc1Cl)C1=C(CC2(CC2)C1)c1ccc(cc1)S(C)(=O)=O
InChI Key InChIKey=IXOVKZSZDFZOQP-UHFFFAOYSA-N
Data  3 IC50
  Tab Delimited (TSV)   2D SDfile   Computed 3D by Vconf -m prep SDfile
Find this compound or compounds like it in BindingDB:
Activity Spreadsheet -- Enzyme Inhibition Constant Data from BindingDB
Found 3 hits for monomerid = 50049031
TargetProstaglandin G/H synthase 1(Homo sapiens (Human))
Searle Research And Development
Curated by ChEMBL
LigandPNGBDBM50049031(5-(3,5-Dichloro-4-methoxy-phenyl)-6-(4-methanesulf...)
Affinity DataIC50: >1.00E+5nM. Assay description: Inhibitory activity against prostaglandin G/H synthase 1 (COX-1).
In DepthDetails ArticlePubMed
TargetProstaglandin G/H synthase 2(Homo sapiens (Human))
Universit£
Curated by ChEMBL
LigandPNGBDBM50049031(5-(3,5-Dichloro-4-methoxy-phenyl)-6-(4-methanesulf...)
Affinity DataIC50:  6.03nM. Assay description: Inhibition of human Prostaglandin G/H synthase 2
In DepthDetails ArticlePubMed
TargetProstaglandin G/H synthase 2(Homo sapiens (Human))
Universit£
Curated by ChEMBL
LigandPNGBDBM50049031(5-(3,5-Dichloro-4-methoxy-phenyl)-6-(4-methanesulf...)
Affinity DataIC50:  6nM. Assay description: Inhibitory activity of the compound against prostaglandin G/H synthase 2 (COX-2).
In DepthDetails ArticlePubMed