BDBM50049035 5-(3-Fluoro-4-methoxy-phenyl)-6-(4-methanesulfonyl-phenyl)-spiro[2.4]hept-5-ene::CHEMBL88550
SMILES COc1ccc(cc1F)C1=C(CC2(CC2)C1)c1ccc(cc1)S(C)(=O)=O
InChI Key InChIKey=BEOGCILHKFFOIQ-UHFFFAOYSA-N
Data  3 IC50
  Tab Delimited (TSV)   2D SDfile   Computed 3D by Vconf -m prep SDfile
Find this compound or compounds like it in BindingDB:
Activity Spreadsheet -- Enzyme Inhibition Constant Data from BindingDB
Found 3 hits for monomerid = 50049035
TargetProstaglandin G/H synthase 1(Homo sapiens (Human))
Searle Research And Development
Curated by ChEMBL
LigandPNGBDBM50049035(5-(3-Fluoro-4-methoxy-phenyl)-6-(4-methanesulfonyl...)
Affinity DataIC50: >1.00E+5nM. Assay description: Inhibitory activity against prostaglandin G/H synthase 1 (COX-1).
In DepthDetails ArticlePubMed
TargetProstaglandin G/H synthase 2(Homo sapiens (Human))
Universit£
Curated by ChEMBL
LigandPNGBDBM50049035(5-(3-Fluoro-4-methoxy-phenyl)-6-(4-methanesulfonyl...)
Affinity DataIC50:  10nM. Assay description: Inhibition of human Prostaglandin G/H synthase 2
In DepthDetails ArticlePubMed
TargetProstaglandin G/H synthase 2(Homo sapiens (Human))
Universit£
Curated by ChEMBL
LigandPNGBDBM50049035(5-(3-Fluoro-4-methoxy-phenyl)-6-(4-methanesulfonyl...)
Affinity DataIC50:  10nM. Assay description: Inhibitory activity of the compound against prostaglandin G/H synthase 2 (COX-2).
In DepthDetails ArticlePubMed