BDBM50049405 3,5,7-Trimethoxy-2-(3,4,5-trimethoxy-phenyl)-chromen-4-one::CHEMBL357089
SMILES COc1cc(OC)c2c(c1)oc(-c1cc(OC)c(OC)c(OC)c1)c(OC)c2=O
InChI Key InChIKey=CMRBCUQYNLDSKE-UHFFFAOYSA-N
Data  2 KI
  Tab Delimited (TSV)   2D SDfile   Computed 3D by Vconf -m prep SDfile
Find this compound or compounds like it in BindingDB:
Activity Spreadsheet -- Enzyme Inhibition Constant Data from BindingDB
Found 2 hits for monomerid = 50049405
TargetAdenosine receptor A3(Homo sapiens (Human))
National Institute Of Diabetes
Curated by ChEMBL
LigandPNGBDBM50049405(3,5,7-Trimethoxy-2-(3,4,5-trimethoxy-phenyl)-chrom...)
Affinity DataKi:  6.61E+3nM. Assay description: Ability to displace [125I]-AB-MECA binding from adenosine A3 receptor.Checked by Author
In DepthDetails ArticlePubMed
TargetAdenosine receptor A3(Homo sapiens (Human))
National Institute Of Diabetes
Curated by ChEMBL
LigandPNGBDBM50049405(3,5,7-Trimethoxy-2-(3,4,5-trimethoxy-phenyl)-chrom...)
Affinity DataKi:  1.62E+4nM. Assay description: Displacement of [125I]-AB-MECA binding to human Adenosine A3 receptor expressed in HEK-293 cells
In DepthDetails ArticlePubMed