BDBM50051464 1-(2-Dodecyl-2H-tetrazol-5-yl)-cyclopentanecarboxylic acid (2,4,6-trimethoxy-phenyl)-amide::CHEMBL421315
SMILES CCCCCCCCCCCCn1nnc(n1)C1(CCCC1)C(=O)Nc1c(OC)cc(OC)cc1OC
InChI Key InChIKey=BXRGNWVAOFITIB-UHFFFAOYSA-N
Data  1 IC50
  Tab Delimited (TSV)   2D SDfile   Computed 3D by Vconf -m prep SDfile
Find this compound or compounds like it in BindingDB:
Activity Spreadsheet -- Enzyme Inhibition Constant Data from BindingDB
Found 1 hit for monomerid = 50051464
TargetSterol O-acyltransferase 1(Rattus norvegicus)
Warner-Lambert
Curated by ChEMBL
LigandPNGBDBM50051464(1-(2-Dodecyl-2H-tetrazol-5-yl)-cyclopentanecarboxy...)
Affinity DataIC50:  63nM. Assay description: In vitro inhibitory activity against acyl coenzyme A:cholesterol acyltransferase 1 of liver microsomes isolated from cholesterol-fed rats.
In DepthDetails ArticlePubMed