BDBM50052307 CHEMBL3318532
SMILES Nc1cc(N)nc(SC2=C(O)CC(CC2=O)c2ccccc2)n1
InChI Key InChIKey=KOENHDVEWRKYIN-UHFFFAOYSA-N
Data  1 IC50
  Tab Delimited (TSV)   2D SDfile   Computed 3D by Vconf -m prep SDfile
Find this compound or compounds like it in BindingDB:
Activity Spreadsheet -- Enzyme Inhibition Constant Data from BindingDB
Found 1 hit for monomerid = 50052307
TargetL-lactate dehydrogenase A chain(Homo sapiens (Human))
Genentech
Curated by ChEMBL
LigandPNGBDBM50052307(CHEMBL3318532)
Affinity DataIC50:  6.80E+3nM. Assay description: Inhibition of human recombinant carboxy-terminal His-tagged LDHA by UV endpoint assay
In DepthDetails ArticlePubMed