BDBM50052402 CHEMBL3318478
SMILES OC1=C(Sc2ccccc2C#N)C(=O)CC(C1)c1ccccc1Cl
InChI Key InChIKey=FRDPBKSHBPITEB-UHFFFAOYSA-N
Data  2 IC50
  Tab Delimited (TSV)   2D SDfile   Computed 3D by Vconf -m prep SDfile
Find this compound or compounds like it in BindingDB:
Activity Spreadsheet -- Enzyme Inhibition Constant Data from BindingDB
Found 2 hits for monomerid = 50052402
TargetL-lactate dehydrogenase A chain(Homo sapiens (Human))
Genentech
Curated by ChEMBL
LigandPNGBDBM50052402(CHEMBL3318478)
Affinity DataIC50: >1.00E+5nM. Assay description: Inhibition of human recombinant carboxy-terminal His-tagged LDHA by UV endpoint assay
In DepthDetails ArticlePubMed
TargetL-lactate dehydrogenase B chain(Homo sapiens (Human))
Genentech
Curated by ChEMBL
LigandPNGBDBM50052402(CHEMBL3318478)
Affinity DataIC50:  6.60E+3nM. Assay description: Inhibition of human recombinant carboxy-terminal His-tagged LDHB by UV endpoint assay
In DepthDetails ArticlePubMed