BDBM50052431 CHEMBL3318416
SMILES OC1=C(Sc2ccccc2Br)C(=O)CC(C1)c1ccccc1
InChI Key InChIKey=UERPVFJYASLFHG-UHFFFAOYSA-N
Data  1 IC50
  Tab Delimited (TSV)   2D SDfile   Computed 3D by Vconf -m prep SDfile
Find this compound or compounds like it in BindingDB:
Activity Spreadsheet -- Enzyme Inhibition Constant Data from BindingDB
Found 1 hit for monomerid = 50052431
TargetL-lactate dehydrogenase A chain(Homo sapiens (Human))
Genentech
Curated by ChEMBL
LigandPNGBDBM50052431(CHEMBL3318416)
Affinity DataIC50:  5.30E+4nM. Assay description: Inhibition of human recombinant carboxy-terminal His-tagged LDHA by UV endpoint assay
In DepthDetails ArticlePubMed