BDBM50053336 CHEMBL3330264
SMILES NS(=O)(=O)c1cccc(c1)-c1n[nH]c2ccc(cc12)C(=O)NCc1ccccc1
InChI Key InChIKey=FAMWOWZEJKDGFC-UHFFFAOYSA-N
Data  1 IC50
  Tab Delimited (TSV)   2D SDfile   Computed 3D by Vconf -m prep SDfile
Find this compound or compounds like it in BindingDB:
Activity Spreadsheet -- Enzyme Inhibition Constant Data from BindingDB
Found 1 hit for monomerid = 50053336
TargetDual specificity protein kinase TTK(Homo sapiens (Human))
University Health Network
Curated by ChEMBL
LigandPNGBDBM50053336(CHEMBL3330264)
Affinity DataIC50:  90nM. Assay description: Inhibition of SUMO-tagged human TTK (1-275 residues) compound pre-incubated for 15 mins prior ATP addition by MBP-based assay
In DepthDetails ArticlePubMed