BDBM50055090 CHEMBL3317568
SMILES Nc1nc(Cc2cccc(O)c2)nc2cn(nc12)-c1ccccc1
InChI Key InChIKey=HBCWGZIBWZBFED-UHFFFAOYSA-N
Data  3 KI
  Tab Delimited (TSV)   2D SDfile   Computed 3D by Vconf -m prep SDfile
Find this compound or compounds like it in BindingDB:
Activity Spreadsheet -- Enzyme Inhibition Constant Data from BindingDB
Found 3 hits for monomerid = 50055090
TargetAdenosine receptor A1(Homo sapiens (Human))
Universit£
Curated by ChEMBL
LigandPNGBDBM50055090(CHEMBL3317568)
Affinity DataKi:  312nM. Assay description: Displacement of [3H]-DPCPX from human adenosine A1 receptor expressed in CHO cells by scintillation counting analysis
In DepthDetails ArticlePubMed
TargetAdenosine receptor A3(Homo sapiens (Human))
Universit£
Curated by ChEMBL
LigandPNGBDBM50055090(CHEMBL3317568)
Affinity DataKi:  435nM. Assay description: Displacement of [3H]AB-MECA from human adenosine A3 receptor expressed in CHO cells by scintillation counting analysis
In DepthDetails ArticlePubMed
TargetAdenosine receptor A2a(Homo sapiens (Human))
Universit£
Curated by ChEMBL
LigandPNGBDBM50055090(CHEMBL3317568)
Affinity DataKi:  521nM. Assay description: Displacement of [3H]ZM241385 from human adenosine A2A receptor expressed in CHO cells by scintillation counting analysis
In DepthDetails ArticlePubMed