BDBM50055737 (1-Benzyl-5-methoxy-2-methyl-1H-indol-3-yl)-acetic acid::1-BENZYL-5-METHOXY-2-METHYL-1H-INDOL-3-YL)-ACETIC ACID::CHEMBL148756
SMILES COc1ccc2n(Cc3ccccc3)c(C)c(CC(O)=O)c2c1
InChI Key InChIKey=ZEKCBTQHDTUHRJ-UHFFFAOYSA-N
Data  2 IC50
PDB links: 1 PDB ID matches this monomer.
  Tab Delimited (TSV)   2D SDfile   Computed 3D by Vconf -m prep SDfile
Find this compound or compounds like it in BindingDB:
Activity Spreadsheet -- Enzyme Inhibition Constant Data from BindingDB
Found 2 hits for monomerid = 50055737
TargetPhospholipase A2(Homo sapiens (Human))
Niddk
Curated by ChEMBL
LigandPNGBDBM50055737((1-Benzyl-5-methoxy-2-methyl-1H-indol-3-yl)-acetic...)
Affinity DataIC50:  1.36E+4nM. Assay description: Inhibition of human non pancreatic secretory phospholipase A2 incubated for 30 mins by plate reader analysis
In DepthDetails PubMed
TargetPhospholipase A2, membrane associated(Homo sapiens (Human))
Eli Lilly
Curated by ChEMBL
LigandPNGBDBM50055737((1-Benzyl-5-methoxy-2-methyl-1H-indol-3-yl)-acetic...)
Affinity DataIC50:  1.36E+4nM. Assay description: Inhibition of Human Nonpancreatic Secretory Phospholipase A2 through Chromogenic assay