BDBM50059379 4-Furan-2-yl-2-methyl-6-phenyl-1,4-dihydro-pyridine-3,5-dicarboxylic acid diethyl ester::CHEMBL89797
SMILES CCOC(=O)C1C(c2ccco2)C(C(=O)OCC)=C(N=C1C)c1ccccc1
InChI Key InChIKey=QWVJJNOXMJFLIF-UHFFFAOYSA-N
Data  2 KI
  Tab Delimited (TSV)   2D SDfile   Computed 3D by Vconf -m prep SDfile
Find this compound or compounds like it in BindingDB:
Activity Spreadsheet -- Enzyme Inhibition Constant Data from BindingDB
Found 2 hits for monomerid = 50059379
TargetAdenosine receptor A3(Homo sapiens (Human))
National Institute Of Diabetes
Curated by ChEMBL
LigandPNGBDBM50059379(4-Furan-2-yl-2-methyl-6-phenyl-1,4-dihydro-pyridin...)
Affinity DataKi:  507nM. Assay description: Displacement of specific [125I]-AB-MECA binding at human adenosine A3 receptor.
In DepthDetails ArticlePubMed
TargetAdenosine receptor A1(Rattus norvegicus (rat))
National Institute Of Diabetes
Curated by ChEMBL
LigandPNGBDBM50059379(4-Furan-2-yl-2-methyl-6-phenyl-1,4-dihydro-pyridin...)
Affinity DataKi:  1.54E+4nM. Assay description: Displacement of specific [3H]-(R)-PIA binding at adenosine A1 receptor from rat brain membranes.
In DepthDetails ArticlePubMed