BDBM50065836 CHEMBL542429::N-(4-Amino-phenyl)-acetamidine
SMILES CC(N)=Nc1ccc(N)cc1
InChI Key InChIKey=ZGVXFKBZIVMYPJ-UHFFFAOYSA-N
Data  3 KI
  Tab Delimited (TSV)   2D SDfile   Computed 3D by Vconf -m prep SDfile
Find this compound or compounds like it in BindingDB:
Activity Spreadsheet -- Enzyme Inhibition Constant Data from BindingDB
Found 3 hits for monomerid = 50065836
TargetNitric oxide synthase, brain(Homo sapiens (Human))
Glaxo Wellcome Research And Development
Curated by ChEMBL
LigandPNGBDBM50065836(CHEMBL542429 | N-(4-Amino-phenyl)-acetamidine)
Affinity DataKi:  1.40E+4nM. Assay description: Inhibitory activity against human neuronal nitric oxide synthase (nNOS) isoenzyme.
In DepthDetails ArticlePubMed
TargetNitric oxide synthase, endothelial(Homo sapiens (Human))
Glaxo Wellcome Research And Development
Curated by ChEMBL
LigandPNGBDBM50065836(CHEMBL542429 | N-(4-Amino-phenyl)-acetamidine)
Affinity DataKi:  2.70E+4nM. Assay description: Inhibitory activity against human endothelial nitric oxide synthase (eNOS) isoenzyme.
In DepthDetails ArticlePubMed
TargetNitric oxide synthase, inducible(Homo sapiens (Human))
Glaxo Wellcome Research And Development
Curated by ChEMBL
LigandPNGBDBM50065836(CHEMBL542429 | N-(4-Amino-phenyl)-acetamidine)
Affinity DataKi:  4.60E+4nM. Assay description: Inhibitory activity against human inducible nitric oxide synthase (iNOS) isoenzyme.
In DepthDetails ArticlePubMed