BDBM50067224 CHEMBL130437::{6-[4-(N-Prop-2-ynylcarbamimidoyl)-benzoylamino]-chroman-3-yl}-acetic acid
SMILES OC(=O)CC1COc2ccc(NC(=O)c3ccc(cc3)C(=N)NCC#C)cc2C1
InChI Key InChIKey=RFJPNVAPTYAFSN-UHFFFAOYSA-N
Data  1 IC50
  Tab Delimited (TSV)   2D SDfile   Computed 3D by Vconf -m prep SDfile
Find this compound or compounds like it in BindingDB:
Activity Spreadsheet -- Enzyme Inhibition Constant Data from BindingDB
Found 1 hit for monomerid = 50067224
TargetIntegrin alpha-IIb/beta-3(Homo sapiens (Human))
Mitsui Pharmaceuticals
Curated by ChEMBL
LigandPNGBDBM50067224(CHEMBL130437 | {6-[4-(N-Prop-2-ynylcarbamimidoyl)-...)
Affinity DataIC50:  0.130nM. Assay description: Inhibition of Fibronogen binding to Immobilized Human Fibrinogen Receptor.
In DepthDetails ArticlePubMed