BDBM50068467 CHEMBL3403445::US9598440, 11
SMILES Nc1ncc(-c2nc(cs2)-c2ccccc2)c(N[C@@H]2C[C@H](CO)[C@@H](O)[C@H]2O)n1
InChI Key InChIKey=JDFVOZWPDXFWCW-CUBALJKWSA-N
Data  2 IC50
  Tab Delimited (TSV)   2D SDfile   Computed 3D by Vconf -m prep SDfile
Find this compound or compounds like it in BindingDB:
Activity Spreadsheet -- Enzyme Inhibition Constant Data from BindingDB
Found 2 hits for monomerid = 50068467
TargetInterleukin-1 receptor-associated kinase 4(Homo sapiens (Human))
Merck Sharp & Dohme
US Patent
LigandPNGBDBM50068467(CHEMBL3403445 | US9598440, 11)
Affinity DataIC50:  409nM. Assay description: Procedure: A 20 μl reaction mixture contains 10 mM TriHCl, pH 7.2, 0.5 nM GST tagged IRAK4 (SignalChem), 100 nM fluorescent peptide substrate (R...
In DepthDetails US Patent
TargetInterleukin-1 receptor-associated kinase 4(Homo sapiens (Human))
Merck Sharp & Dohme
US Patent
LigandPNGBDBM50068467(CHEMBL3403445 | US9598440, 11)
Affinity DataIC50:  410nM. Assay description: Inhibition of N-terminal GST tagged human recombinant full-length IRAK4 expressed in Sf9 insect cells assessed as reduction in substrate phosphorylat...
In DepthDetails ArticlePubMed