BDBM50069816 4-((3R,4R)-4-Methyl-pyrrolidin-3-yl)-1H-imidazole::4-((3R,4R)-4-methylpyrrolidin-3-yl)-1H-imidazole::CHEMBL313127::SCH-50971
SMILES C[C@H]1CNC[C@@H]1c1cnc[nH]1
InChI Key InChIKey=KTEPQLOOQDLKHF-BQBZGAKWSA-N
Data  2 KI
  Tab Delimited (TSV)   2D SDfile   Computed 3D by Vconf -m prep SDfile
Find this compound or compounds like it in BindingDB:
Activity Spreadsheet -- Enzyme Inhibition Constant Data from BindingDB
Found 2 hits for monomerid = 50069816
TargetHistamine H3 receptor(GUINEA PIG)
Schering-Plough Research Institute
Curated by ChEMBL
LigandPNGBDBM50069816(4-((3R,4R)-4-Methyl-pyrrolidin-3-yl)-1H-imidazole ...)
Affinity DataKi:  2.30nM. Assay description: Inhibition of [3H]-N-alpha-methylhistamine binding to guinea pig brain Histamine H3 receptor
In DepthDetails ArticlePubMed
TargetHistamine H1 receptor(Cavia porcellus (domestic guinea pig))
Schering-Plough Research Institute
Curated by ChEMBL
LigandPNGBDBM50069816(4-((3R,4R)-4-Methyl-pyrrolidin-3-yl)-1H-imidazole ...)
Affinity DataKi: >1.00E+4nM. Assay description: Binding affinity of the compound to H-1 receptor was determined in guinea pig brain tissue using [3H]- N alpha-methylhistamine ligand
In DepthDetails ArticlePubMed