BDBM50070918 CHEMBL3559407
SMILES CC(C)C[C@H](NP(O)(=O)CNC(=O)OCc1ccccc1)C(=O)N[C@@H](Cc1ccccc1)C(O)=O
InChI Key InChIKey=LSBJYKCMZGPGPG-SFTDATJTSA-N
Data  1 KI
PDB links: 1 PDB ID matches this monomer.
  Tab Delimited (TSV)   2D SDfile   Computed 3D by Vconf -m prep SDfile
Find this compound or compounds like it in BindingDB:
Activity Spreadsheet -- Enzyme Inhibition Constant Data from BindingDB
Found 1 hit for monomerid = 50070918
TargetThermolysin(Bacillus thermoproteolyticus)
The State University Of New York
Curated by ChEMBL
LigandPNGBDBM50070918(CHEMBL3559407)
Affinity DataKi:  54nM. Assay description: Inhibition of Bacillus thermoproteolyticus TLN using 2-furanacryloyl-Gly-Leu-NH2 substrate by biochemical assay