BDBM50071186 9-Ethoxy-2-methyl-11,12-dihydro-3H,6aH,13H-6-oxa-3,12a-diaza-benzo[a]cyclopenta[h]anthracene-1-carboxylic acid ethyl ester::CHEMBL62247
SMILES CCOC(=O)c1c(C)[nH]c2ccc3OC4N(CCc5cc(OCC)ccc45)Cc3c12
InChI Key InChIKey=BDIZCMDNZUBLMP-UHFFFAOYSA-N
Data  5 IC50
  Tab Delimited (TSV)   2D SDfile   Computed 3D by Vconf -m prep SDfile
Find this compound or compounds like it in BindingDB:
Activity Spreadsheet -- Enzyme Inhibition Constant Data from BindingDB
Found 5 hits for monomerid = 50071186
TargetMuscarinic acetylcholine receptor M2(Homo sapiens (Human))
Parke-Davis Pharmaceutical Research
Curated by ChEMBL
LigandPNGBDBM50071186(9-Ethoxy-2-methyl-11,12-dihydro-3H,6aH,13H-6-oxa-3...)
Affinity DataIC50:  2.57E+3nM. Assay description: Evaluated for its binding affinity at human muscarinic receptor m2 by displacement of [3H]NMS binding using membranes from transfected chinese hamste...
In DepthDetails ArticlePubMed
TargetMuscarinic acetylcholine receptor M4(Homo sapiens (Human))
Parke-Davis Pharmaceutical Research
Curated by ChEMBL
LigandPNGBDBM50071186(9-Ethoxy-2-methyl-11,12-dihydro-3H,6aH,13H-6-oxa-3...)
Affinity DataIC50:  1.62E+3nM. Assay description: Evaluated for its binding affinity at human muscarinic receptor m4 by the displacement of [3H]NMS binding using membranes from transfected chinese ha...
In DepthDetails ArticlePubMed
TargetMuscarinic acetylcholine receptor M1(Homo sapiens (Human))
Parke-Davis Pharmaceutical Research
Curated by ChEMBL
LigandPNGBDBM50071186(9-Ethoxy-2-methyl-11,12-dihydro-3H,6aH,13H-6-oxa-3...)
Affinity DataIC50:  4.25E+3nM. Assay description: Evaluated for its binding affinity at human muscarinic receptor m1 by displacement of [3H]NMS binding using membranes in transfected chinese hamster ...
In DepthDetails ArticlePubMed
TargetMuscarinic acetylcholine receptor M5(Homo sapiens (Human))
Parke-Davis Pharmaceutical Research
Curated by ChEMBL
LigandPNGBDBM50071186(9-Ethoxy-2-methyl-11,12-dihydro-3H,6aH,13H-6-oxa-3...)
Affinity DataIC50:  8.62E+3nM. Assay description: Evaluated for its binding affinity at human muscarinic receptor m5 by the displacement of [3H]NMS binding using membranes from transfected chinese ha...
In DepthDetails ArticlePubMed
TargetMuscarinic acetylcholine receptor M3(Homo sapiens (Human))
Parke-Davis Pharmaceutical Research
Curated by ChEMBL
LigandPNGBDBM50071186(9-Ethoxy-2-methyl-11,12-dihydro-3H,6aH,13H-6-oxa-3...)
Affinity DataIC50:  2.63E+3nM. Assay description: Evaluated for its binding affinity at human muscarinic receptor m3 by the displacement of [3H]NMS binding using membranes from transfected chinese ha...
In DepthDetails ArticlePubMed