BDBM50071476 1'N-[2-(1H-3-indolyl)-1-phenethylcarbamoyl-(1S)-ethyl]spiro[2,3-dihydro-1H-indene-1,4'-(hexahydropyridine)]-1'-carboxamide::CHEMBL74176
SMILES O=C(NCCc1ccccc1)[C@H](Cc1c[nH]c2ccccc12)NC(=O)N1CCC2(CCc3ccccc23)CC1
InChI Key InChIKey=JVCKKWZCSIKZIY-PMERELPUSA-N
Data  2 IC50
  Tab Delimited (TSV)   2D SDfile   Computed 3D by Vconf -m prep SDfile
Find this compound or compounds like it in BindingDB:
Activity Spreadsheet -- Enzyme Inhibition Constant Data from BindingDB
Found 2 hits for monomerid = 50071476
TargetSubstance-P receptor(Homo sapiens (Human))
Merck Research Laboratories
Curated by ChEMBL
LigandPNGBDBM50071476(1'N-[2-(1H-3-indolyl)-1-phenethylcarbamoyl-(1S)-et...)
Affinity DataIC50:  332nM. Assay description: Inhibition of cloned human NK1 (Neurokinin 1) receptor, stably expressed in chinese hamster ovary (CHO) cells was determined
In DepthDetails ArticlePubMed
TargetSubstance-K receptor(Homo sapiens (Human))
Merck Research Laboratories
Curated by ChEMBL
LigandPNGBDBM50071476(1'N-[2-(1H-3-indolyl)-1-phenethylcarbamoyl-(1S)-et...)
Affinity DataIC50:  211nM. Assay description: Inhibition of cloned human NK2 (Neurokinin 2) receptor, stably expressed in chinese hamster ovary (CHO) cells was determined
In DepthDetails ArticlePubMed