BDBM50073105 CHEMBL3410855
SMILES [H][C@]12CC[C@@]([H])(CC(C1)NS(=O)(=O)CC)N2c1ccc(C#N)c(c1)C(F)(F)F
InChI Key InChIKey=VUSBBKCOXGTGTA-KBPBESRZSA-N
Data  2 IC50
  Tab Delimited (TSV)   2D SDfile   Computed 3D by Vconf -m prep SDfile
Find this compound or compounds like it in BindingDB:
Activity Spreadsheet -- Enzyme Inhibition Constant Data from BindingDB
Found 2 hits for monomerid = 50073105
TargetAndrogen receptor(Homo sapiens (Human))
University Of Gothenburg
Curated by ChEMBL
LigandPNGBDBM50073105(CHEMBL3410855)
Affinity DataIC50:  2.04E+3nM. Assay description: Displacement of [3H]R1881 from pSG5-tagged human androgen receptor expressed in COS1 cells assessed as relative binding inhibition
In DepthDetails ArticlePubMed
TargetAndrogen receptor(Homo sapiens (Human))
University Of Gothenburg
Curated by ChEMBL
LigandPNGBDBM50073105(CHEMBL3410855)
Affinity DataIC50:  2.04E+3nM. Assay description: Antagonist activity against pSG5-tagged human androgen receptor expressed in COS1 cells assessed as reduction in receptor-mediated transcriptional ac...
In DepthDetails ArticlePubMed