BDBM50073470 (3R,4R)-1-Ethyl-4-phenyl-piperidine-3-carboxylic acid hexyl ester; oxalic acid::CHEMBL340780
SMILES CCCCCCOC(=O)[C@H]1CN(CC)CC[C@H]1c1ccccc1
InChI Key InChIKey=GZRIGDJQQNOXAM-OALUTQOASA-N
Data  5 IC50
  Tab Delimited (TSV)   2D SDfile   Computed 3D by Vconf -m prep SDfile
Find this compound or compounds like it in BindingDB:
Activity Spreadsheet -- Enzyme Inhibition Constant Data from BindingDB
Found 5 hits for monomerid = 50073470
TargetMuscarinic acetylcholine receptor M4(Homo sapiens (Human))
Warner-Lambert
Curated by ChEMBL
LigandPNGBDBM50073470((3R,4R)-1-Ethyl-4-phenyl-piperidine-3-carboxylic a...)
Affinity DataIC50:  573nM. Assay description: Displacement of [3H]NMS binding to human Muscarinic acetylcholine receptor M4 using membranes from transfected CHO cells
In DepthDetails ArticlePubMed
TargetMuscarinic acetylcholine receptor M5(Homo sapiens (Human))
Warner-Lambert
Curated by ChEMBL
LigandPNGBDBM50073470((3R,4R)-1-Ethyl-4-phenyl-piperidine-3-carboxylic a...)
Affinity DataIC50:  222nM. Assay description: Displacement of [3H]NMS binding to human Muscarinic acetylcholine receptor M5 using membranes from transfected CHO cells
In DepthDetails ArticlePubMed
TargetMuscarinic acetylcholine receptor M1(Homo sapiens (Human))
Warner-Lambert
Curated by ChEMBL
LigandPNGBDBM50073470((3R,4R)-1-Ethyl-4-phenyl-piperidine-3-carboxylic a...)
Affinity DataIC50:  61nM. Assay description: Displacement of [3H]NMS binding to human Muscarinic acetylcholine receptor M1 using membranes from transfected CHO cells
In DepthDetails ArticlePubMed
TargetMuscarinic acetylcholine receptor M3(Homo sapiens (Human))
Warner-Lambert
Curated by ChEMBL
LigandPNGBDBM50073470((3R,4R)-1-Ethyl-4-phenyl-piperidine-3-carboxylic a...)
Affinity DataIC50:  220nM. Assay description: Displacement of [3H]-NMS binding to human Muscarinic acetylcholine receptor M3 using membranes from transfected CHO cells
In DepthDetails ArticlePubMed
TargetMuscarinic acetylcholine receptor M2(Homo sapiens (Human))
Warner-Lambert
Curated by ChEMBL
LigandPNGBDBM50073470((3R,4R)-1-Ethyl-4-phenyl-piperidine-3-carboxylic a...)
Affinity DataIC50:  405nM. Assay description: Displacement of [3H]NMS binding to human Muscarinic acetylcholine receptor M2 using membranes from transfected CHO cells
In DepthDetails ArticlePubMed